大佬求助下载组件query-string后启动项目报错



  • Task :app:transformNativeLibsWithMergeJniLibsForDebug FAILED

    Deprecated Gradle features were used in this build, making it incompatible with Gradle 6.0.
    Use '--warning-mode all' to show the individual deprecation warnings.
    See https://docs.gradle.org/5.5/userguide/command_line_interface.html#sec:command_line_warnings
    24 actionable tasks: 2 executed, 22 up-to-date

    FAILURE: Build failed with an exception.

    • What went wrong:
      Execution failed for task ':app:transformNativeLibsWithMergeJniLibsForDebug'.

    Unable to delete directory 'D:\wy1907\js.3\myApp1\android\app\build\intermediates\transforms\mergeJniLibs\debug\0\lib' after 10 attempts

    • Try:
      Run with --stacktrace option to get the stack trace. Run with --info or --debug option to get more log output. Run with --scan to get full insights.

    • Get more help at https://help.gradle.org

    BUILD FAILED in 1m 22s

    error Failed to install the app. Make sure you have the Android development environment set up: https://facebook.github.io/react-native/docs/getting-started.html#android-development-environment. Run CLI with --verbose flag for more details.
    Error: Command failed: gradlew.bat app:installDebug -PreactNativeDevServerPort=8081

    FAILURE: Build failed with an exception.

    • What went wrong:
      Execution failed for task ':app:transformNativeLibsWithMergeJniLibsForDebug'.

    Unable to delete directory 'D:\wy1907\js.3\myApp1\android\app\build\intermediates\transforms\mergeJniLibs\debug\0\lib' after 10 attempts

    • Try:
      Run with --stacktrace option to get the stack trace. Run with --info or --debug option to get more log output. Run with --scan to get full insights.

    • Get more help at https://help.gradle.org

    BUILD FAILED in 1m 22s

    at checkExecSyncError (child_process.js:629:11)
    at execFileSync (child_process.js:647:13)
    at runOnAllDevices (d:\wy1907\js.3\myApp1\node_modules\@react-native-community\cli-platform-android\build\commands\runAndroid\runOnAllDevices.js:94:39)
    at buildAndRun (d:\wy1907\js.3\myApp1\node_modules\@react-native-community\cli-platform-android\build\commands\runAndroid\index.js:158:41)
    at then.result (d:\wy1907\js.3\myApp1\node_modules\@react-native-community\cli-platform-android\build\commands\runAndroid\index.js:125:12)
    at process._tickCallback (internal/process/next_tick.js:68:7)

Log in to reply