在mac上进行对android打包出现错误,看下面出现的问题,求帮助!谢谢



    • What went wrong:
      Execution failed for task ':app:processReleaseResources'.

    Failed to execute aapt

    • Try:
      Run with --stacktrace option to get the stack trace. Run with --info or --debug option to get more log output.

    • Get more help at https://help.gradle.org

    BUILD FAILED in 6s
    172 actionable tasks: 162 executed, 10 up-to-date
    npm ERR! code ELIFECYCLE
    npm ERR! errno 1
    npm ERR! payday_loan@0.0.1 bundle-android: ruby bundle.rb && cd android && ./gradlew assembleRelease && cd ..
    npm ERR! Exit status 1
    npm ERR!
    npm ERR! Failed at the payday_loan@0.0.1 bundle-android script.
    npm ERR! This is probably not a problem with npm. There is likely additional logging output above.

    npm ERR! A complete log of this run can be found in:
    npm ERR! /Users/gshz/.npm/_logs/2017-11-13T02_27_52_971Z-debug.log


登录后回复